{"text_format":"1","workbook":"xlsx","n_sheets":4,"sheets":["Run Count Table","10 year club","Data","Notes"],"not_rendered":{"charts":0,"images":0,"macros":0,"external_links":0,"defined_names":9,"comments":0,"pivot_tables":1},"unopened":[],"bounds":{"document_bytes":16777216,"sheet_cells":100000,"rows_first":2000,"rows_last":500,"rows_between":2000,"halvings":0,"cell_chars":16384,"cell_head_chars":4096},"cells_cut":0,"cells_raw":0,"read":"whole","date_system":"1900"}

{"sheet":"Run Count Table","index":0,"n_rows":2233,"n_cols":4,"rows_kept":2233,"cut":false,"hidden":false,"merged":[]}
["TRF Running Festival - Marathon Records"]
["From 1973 to 2024"]
["Number of Marathons Runs Completed",null,null,{"$f":"COUNTIFS(Data!G3:G3663,\"<>DNF\")","v":3599}]
["Total Kilometres Run at TRF Marathon",null,null,{"$f":"D3*42.2","v":151877.80000000002}]
[]
["Name","Year","Time H.MM.SS","Count of Marathons completed"]
["ABDULRAHIM IKHWAN",null,null,1]
["ABEL CRAIG",null,null,1]
["ABRAHAM LOUISE",null,null,2]
["ADAMS BRIAN",null,null,1]
["ADAMS NATHAN",null,null,2]
["ADAMS STEVE",null,null,1]
["ADIE IWALI",null,null,1]
["AINSCOUGH NICK",null,null,3]
["AITKEN RON",null,null,3]
["AKINS DANNY",null,null,3]
["ALBERT RORY",null,null,1]
["ALBURY JIM",null,null,1]
["ALDERSON BENJAMIN",null,null,2]
["ALDERSON JACKSON",null,null,1]
["ALEXANDER KATHERINE",null,null,1]
["ALEXANDER KATIE",null,null,1]
["ALLEN GRAEME",null,null,1]
["ALLEN LISA",null,null,1]
["ALLEN PETE",null,null,1]
["ALROE KATHERINE",null,null,1]
["AMBROSE KYLE",null,null,1]
["AMOS BEAR",null,null,1]
["ANASSON ALEXANDRA",null,null,1]
["ANASSON TOM",null,null,1]
["ANDERSEN MICKAYLA",null,null,1]
["ANDERSEN SHAWN",null,null,1]
["ANDERSON BEN",null,null,1]
["ANDERSON CHELSEA",null,null,1]
["ANDERSON G",null,null,1]
["ANDERSON JOHN",null,null,1]
["ANDERSON KAY",null,null,1]
["ANDERSON LORNE",null,null,1]
["ANDERSON TREVOR",null,null,1]
["ANDERSON WAYNE JOHN",null,null,1]
["ANDERSSEN THOROLD",null,null,1]
["ANDRESS GREG",null,null,1]
["ANDREWS WILLIAM",null,null,1]
["ANSELL TERRY",null,null,2]
["APONTE JUAN",null,null,1]
["APPLEFORD D",null,null,1]
["AQUILINA CHRISTA",null,null,1]
["ARCHER CHRIS",null,null,1]
["ARCHER DEBORAH",null,null,3]
["ARCHER MICHAEL",null,null,4]
["ARDILL JOHN",null,null,1]
["ARMIT BRIAN",null,null,4]
["ARNOLD DAVID",null,null,4]
["ARNOLD ROBERT",null,null,1]
["ARNOLD VANESSA",null,null,1]
["ASHKETTLE BENJAMIN",null,null,1]
["ASHTON BRETT",null,null,1]
["ASTILL NEIL",null,null,2]
["ATCHESON DON",null,null,1]
["ATCHESON PARMY",null,null,1]
["ATKINSON BEN",null,null,1]
["ATKINSON CAMERON",null,null,2]
["ATKINSON DAVID",null,null,1]
["ATWELL ELAINE",null,null,2]
["AULBURY CHRIS",null,null,3]
["AUMULLER ALAN",null,null,1]
["AVENELL KEN",null,null,1]
["AVERY JACQUELINE",null,null,1]
["AXFORD BRENDAN",null,null,2]
["AYERS JOHN",null,null,2]
["AYERS NATALIE",null,null,1]
["AYUKAI MISAKI",null,null,1]
["BABORE TREVOR",null,null,1]
["BACHE MICHAEL",null,null,1]
["BACON LUKE",null,null,1]
["BADDELEY JOANNE",null,null,1]
["BADHAM ANKUR",null,null,1]
["BAGENT ADRIAN",null,null,1]
["BAINBRIDGE DEAN",null,null,7]
["BAINES ALEX",null,null,1]
{"$rows_left_out":2154}
{"sheet":"10 year club","index":1,"n_rows":46,"n_cols":10,"rows_kept":46,"cut":false,"hidden":false,"merged":[]}
["10 Year Club after the 2024 Townsville Running Festival"]
["Name","Name (Surname / First Name) ","10 Year Club Bib","Runs Registered","Runs Not Completed","Runs Completed","Best Time","Last Run"]
[{"$f":"MID(B3,SEARCH(\" \",B3)+1,99)&\" \"&LEFT(B3,SEARCH(\" \",B3)-1)","v":"TONY FELESINA"},"FELESINA TONY",42001,{"$f":"COUNTIFS(Data!E$3:E$3663,B3)","v":24},{"$f":"COUNTIFS(Data!E$3:E$3663,B3,Data!F$3:F$3663,\"DNF\")","v":0},{"$f":"D3-E3","v":24},{"$f":"INDEX(Data!$G$3:$G$3663,MATCH(1,IF(Data!$E$3:$E$3663=$B3,IF(Data!$I$3:$I$3663=\"Fastest\",1)),0))","v":"3.18.29"},{"$f":"_xlfn.MAXIFS(Data!$A$3:$A$3663,Data!$E$3:$E$3663,$B3)","v":2024}]
["DAVID CANNINGS","CANNINGS DAVID",42002,{"$f":"COUNTIFS(Data!E$3:E$3663,B4)","v":21},{"$f":"COUNTIFS(Data!E$3:E$3663,B4,Data!F$3:F$3663,\"DNF\")","v":0},{"$f":"D4-E4","v":21},{"$f":"INDEX(Data!$G$3:$G$3663,MATCH(1,IF(Data!$E$3:$E$3663=$B4,IF(Data!$I$3:$I$3663=\"Fastest\",1)),0))","v":"3.59.32"},{"$f":"_xlfn.MAXIFS(Data!$A$3:$A$3663,Data!$E$3:$E$3663,$B4)","v":2023}]
["ROD RUTHERFORD","RUTHERFORD ROD",42003,{"$f":"COUNTIFS(Data!E$3:E$3663,B5)","v":14},{"$f":"COUNTIFS(Data!E$3:E$3663,B5,Data!F$3:F$3663,\"DNF\")","v":0},14,{"$f":"INDEX(Data!$G$3:$G$3663,MATCH(1,IF(Data!$E$3:$E$3663=$B5,IF(Data!$I$3:$I$3663=\"Fastest\",1)),0))","v":"4.29.51"},{"$f":"_xlfn.MAXIFS(Data!$A$3:$A$3663,Data!$E$3:$E$3663,$B5)","v":2017}]
["GEOFF STANTON","STANTON GEOFF",42004,{"$f":"COUNTIFS(Data!E$3:E$3663,B6)","v":20},{"$f":"COUNTIFS(Data!E$3:E$3663,B6,Data!F$3:F$3663,\"DNF\")","v":0},20,{"$f":"INDEX(Data!$G$3:$G$3663,MATCH(1,IF(Data!$E$3:$E$3663=$B6,IF(Data!$I$3:$I$3663=\"Fastest\",1)),0))","v":"3.28.14"},{"$f":"_xlfn.MAXIFS(Data!$A$3:$A$3663,Data!$E$3:$E$3663,$B6)","v":2023}]
["PAUL CROUCH-CHIVERS","CROUCH-CHIVERS PAUL",42005,{"$f":"COUNTIFS(Data!E$3:E$3663,B7)","v":13},{"$f":"COUNTIFS(Data!E$3:E$3663,B7,Data!F$3:F$3663,\"DNF\")","v":0},13,{"$f":"INDEX(Data!$G$3:$G$3663,MATCH(1,IF(Data!$E$3:$E$3663=$B7,IF(Data!$I$3:$I$3663=\"Fastest\",1)),0))","v":"3.22.20"},{"$f":"_xlfn.MAXIFS(Data!$A$3:$A$3663,Data!$E$3:$E$3663,$B7)","v":2017}]
["STEVEN TITMUS","TITMUS STEVEN",42006,{"$f":"COUNTIFS(Data!E$3:E$3663,B8)","v":20},{"$f":"COUNTIFS(Data!E$3:E$3663,B8,Data!F$3:F$3663,\"DNF\")","v":0},20,{"$f":"INDEX(Data!$G$3:$G$3663,MATCH(1,IF(Data!$E$3:$E$3663=$B8,IF(Data!$I$3:$I$3663=\"Fastest\",1)),0))","v":"3.35.38"},{"$f":"_xlfn.MAXIFS(Data!$A$3:$A$3663,Data!$E$3:$E$3663,$B8)","v":2024}]
["BERNIE NORRIS","NORRIS BERNIE",42007,{"$f":"COUNTIFS(Data!E$3:E$3663,B9)","v":20},{"$f":"COUNTIFS(Data!E$3:E$3663,B9,Data!F$3:F$3663,\"DNF\")","v":0},20,{"$f":"INDEX(Data!$G$3:$G$3663,MATCH(1,IF(Data!$E$3:$E$3663=$B9,IF(Data!$I$3:$I$3663=\"Fastest\",1)),0))","v":"3.11.32"},{"$f":"_xlfn.MAXIFS(Data!$A$3:$A$3663,Data!$E$3:$E$3663,$B9)","v":2024}]
["WAYNE CRASE","CRASE WAYNE",42008,{"$f":"COUNTIFS(Data!E$3:E$3663,B10)","v":13},{"$f":"COUNTIFS(Data!E$3:E$3663,B10,Data!F$3:F$3663,\"DNF\")","v":0},13,{"$f":"INDEX(Data!$G$3:$G$3663,MATCH(1,IF(Data!$E$3:$E$3663=$B10,IF(Data!$I$3:$I$3663=\"Fastest\",1)),0))","v":"3.55.08"},{"$f":"_xlfn.MAXIFS(Data!$A$3:$A$3663,Data!$E$3:$E$3663,$B10)","v":2024}]
["MATTHEW BOSCHEN","BOSCHEN MATTHEW",42009,{"$f":"COUNTIFS(Data!E$3:E$3663,B11)","v":17},{"$f":"COUNTIFS(Data!E$3:E$3663,B11,Data!F$3:F$3663,\"DNF\")","v":0},17,{"$f":"INDEX(Data!$G$3:$G$3663,MATCH(1,IF(Data!$E$3:$E$3663=$B11,IF(Data!$I$3:$I$3663=\"Fastest\",1)),0))","v":"2.59.41"},{"$f":"_xlfn.MAXIFS(Data!$A$3:$A$3663,Data!$E$3:$E$3663,$B11)","v":2024}]
["JOHN NUTTALL","NUTTALL JOHN",42010,{"$f":"COUNTIFS(Data!E$3:E$3663,B12)","v":14},{"$f":"COUNTIFS(Data!E$3:E$3663,B12,Data!F$3:F$3663,\"DNF\")","v":0},14,{"$f":"INDEX(Data!$G$3:$G$3663,MATCH(1,IF(Data!$E$3:$E$3663=$B12,IF(Data!$I$3:$I$3663=\"Fastest\",1)),0))","v":"2.53.37"},{"$f":"_xlfn.MAXIFS(Data!$A$3:$A$3663,Data!$E$3:$E$3663,$B12)","v":2019}]
["RODNEY NORTHFIELD","NORTHFIELD RODNEY",42011,{"$f":"COUNTIFS(Data!E$3:E$3663,B13)","v":15},{"$f":"COUNTIFS(Data!E$3:E$3663,B13,Data!F$3:F$3663,\"DNF\")","v":0},15,{"$f":"INDEX(Data!$G$3:$G$3663,MATCH(1,IF(Data!$E$3:$E$3663=$B13,IF(Data!$I$3:$I$3663=\"Fastest\",1)),0))","v":"3.10.25"},{"$f":"_xlfn.MAXIFS(Data!$A$3:$A$3663,Data!$E$3:$E$3663,$B13)","v":2024}]
["DAVE PERKINS","PERKINS DAVE",42012,{"$f":"COUNTIFS(Data!E$3:E$3663,B14)","v":17},{"$f":"COUNTIFS(Data!E$3:E$3663,B14,Data!F$3:F$3663,\"DNF\")","v":0},17,{"$f":"INDEX(Data!$G$3:$G$3663,MATCH(1,IF(Data!$E$3:$E$3663=$B14,IF(Data!$I$3:$I$3663=\"Fastest\",1)),0))","v":"3.24.31"},{"$f":"_xlfn.MAXIFS(Data!$A$3:$A$3663,Data!$E$3:$E$3663,$B14)","v":2024}]
["GEOFFREY SPROTT","SPROTT GEOFFREY",42013,{"$f":"COUNTIFS(Data!E$3:E$3663,B15)","v":10},{"$f":"COUNTIFS(Data!E$3:E$3663,B15,Data!F$3:F$3663,\"DNF\")","v":0},10,{"$f":"INDEX(Data!$G$3:$G$3663,MATCH(1,IF(Data!$E$3:$E$3663=$B15,IF(Data!$I$3:$I$3663=\"Fastest\",1)),0))","v":"3.16.01"},{"$f":"_xlfn.MAXIFS(Data!$A$3:$A$3663,Data!$E$3:$E$3663,$B15)","v":2018}]
[{"$f":"MID(B16,SEARCH(\" \",B16)+1,99)&\" \"&LEFT(B16,SEARCH(\" \",B16)-1)","v":"COLETTE READ"},"READ COLETTE",42014,{"$f":"COUNTIFS(Data!E$3:E$3663,B16)","v":13},{"$f":"COUNTIFS(Data!E$3:E$3663,B16,Data!F$3:F$3663,\"DNF\")","v":0},{"$f":"D16-E16","v":13},{"$f":"INDEX(Data!$G$3:$G$3663,MATCH(1,IF(Data!$E$3:$E$3663=$B16,IF(Data!$I$3:$I$3663=\"Fastest\",1)),0))","v":"3.11.31"},{"$f":"_xlfn.MAXIFS(Data!$A$3:$A$3663,Data!$E$3:$E$3663,$B16)","v":2024}]
["TONY GORDON","GORDON TONY",42015,{"$f":"COUNTIFS(Data!E$3:E$3663,B17)","v":10},{"$f":"COUNTIFS(Data!E$3:E$3663,B17,Data!F$3:F$3663,\"DNF\")","v":0},10,{"$f":"INDEX(Data!$G$3:$G$3663,MATCH(1,IF(Data!$E$3:$E$3663=$B17,IF(Data!$I$3:$I$3663=\"Fastest\",1)),0))","v":"02:31:41"},{"$f":"_xlfn.MAXIFS(Data!$A$3:$A$3663,Data!$E$3:$E$3663,$B17)","v":2022}]
[{"$f":"MID(B18,SEARCH(\" \",B18)+1,99)&\" \"&LEFT(B18,SEARCH(\" \",B18)-1)","v":"JOHN HOGGAN"},"HOGGAN JOHN",42016,{"$f":"COUNTIFS(Data!E$3:E$3663,B18)","v":12},{"$f":"COUNTIFS(Data!E$3:E$3663,B18,Data!F$3:F$3663,\"DNF\")","v":0},{"$f":"D18-E18","v":12},{"$f":"INDEX(Data!$G$3:$G$3663,MATCH(1,IF(Data!$E$3:$E$3663=$B18,IF(Data!$I$3:$I$3663=\"Fastest\",1)),0))","v":"3.37.36"},{"$f":"_xlfn.MAXIFS(Data!$A$3:$A$3663,Data!$E$3:$E$3663,$B18)","v":2024}]
[{"$f":"MID(B19,SEARCH(\" \",B19)+1,99)&\" \"&LEFT(B19,SEARCH(\" \",B19)-1)","v":"ELDERENE BROSTROM"},"BROSTROM ELDERENE",42017,{"$f":"COUNTIFS(Data!E$3:E$3663,B19)","v":11},{"$f":"COUNTIFS(Data!E$3:E$3663,B19,Data!F$3:F$3663,\"DNF\")","v":0},{"$f":"D19-E19","v":11},{"$f":"INDEX(Data!$G$3:$G$3663,MATCH(1,IF(Data!$E$3:$E$3663=$B19,IF(Data!$I$3:$I$3663=\"Fastest\",1)),0))","v":"4.02.28"},{"$f":"_xlfn.MAXIFS(Data!$A$3:$A$3664,Data!$E$3:$E$3664,$B19)","v":2023}]
["RICK PATZOLD","PATZOLD RICK",42018,{"$f":"COUNTIFS(Data!E$3:E$3663,B20)","v":11},{"$f":"COUNTIFS(Data!E$3:E$3663,B20,Data!F$3:F$3663,\"DNF\")","v":0},11,{"$f":"INDEX(Data!$G$3:$G$3663,MATCH(1,IF(Data!$E$3:$E$3663=$B20,IF(Data!$I$3:$I$3663=\"Fastest\",1)),0))","v":"3.22.19"},{"$f":"_xlfn.MAXIFS(Data!$A$3:$A$3664,Data!$E$3:$E$3664,$B20)","v":2024}]
["PHIL COPP","COPP PHIL",42019,{"$f":"COUNTIFS(Data!E$3:E$3663,B21)","v":10},{"$f":"COUNTIFS(Data!E$3:E$3663,B21,Data!F$3:F$3663,\"DNF\")","v":0},10,{"$f":"INDEX(Data!$G$3:$G$3663,MATCH(1,IF(Data!$E$3:$E$3663=$B21,IF(Data!$I$3:$I$3663=\"Fastest\",1)),0))","v":"2.59.58"},{"$f":"_xlfn.MAXIFS(Data!$A$3:$A$3664,Data!$E$3:$E$3664,$B21)","v":2023}]
["THERESA O'CONNOR","O'CONNOR THERESA",42020,{"$f":"COUNTIFS(Data!E$3:E$3663,B22)","v":11},{"$f":"COUNTIFS(Data!E$3:E$3663,B22,Data!F$3:F$3663,\"DNF\")","v":0},11,{"$f":"INDEX(Data!$G$3:$G$3663,MATCH(1,IF(Data!$E$3:$E$3663=$B22,IF(Data!$I$3:$I$3663=\"Fastest\",1)),0))","v":"4.09.30"},{"$f":"_xlfn.MAXIFS(Data!$A$3:$A$3664,Data!$E$3:$E$3664,$B22)","v":2024}]
[{"$f":"MID(B23,SEARCH(\" \",B23)+1,99)&\" \"&LEFT(B23,SEARCH(\" \",B23)-1)","v":"KEITH FAGG"},"FAGG KEITH",42021,{"$f":"COUNTIFS(Data!E$3:E$4587,B23)","v":11},{"$f":"COUNTIFS(Data!E$3:E$4587,B23,Data!F$3:F$4587,\"DNF\")","v":0},{"$f":"D23-E23","v":11},{"$f":"INDEX(Data!$G$3:$G$4587,MATCH(1,IF(Data!$E$3:$E$4587=$B23,IF(Data!$I$3:$I$4587=\"Fastest\",1)),0))","v":"3.49.04"},{"$f":"_xlfn.MAXIFS(Data!$A$3:$A$3664,Data!$E$3:$E$3664,$B23)","v":2024}]
[{"$f":"MID(B24,SEARCH(\" \",B24)+1,99)&\" \"&LEFT(B24,SEARCH(\" \",B24)-1)","v":"GREG WILSON"},"WILSON GREG",42022,{"$f":"COUNTIFS(Data!E$3:E$4587,B24)","v":10},{"$f":"COUNTIFS(Data!E$3:E$4587,B24,Data!F$3:F$4587,\"DNF\")","v":0},{"$f":"D24-E24","v":10},{"$f":"INDEX(Data!$G$3:$G$4587,MATCH(1,IF(Data!$E$3:$E$4587=$B24,IF(Data!$I$3:$I$4587=\"Fastest\",1)),0))","v":"2.38.36"},{"$f":"_xlfn.MAXIFS(Data!$A$3:$A$3664,Data!$E$3:$E$3664,$B24)","v":2024},null,"10th TRF Marathon in 2024"]
["TAMARA RYAN","RYAN TAMARA",42023,{"$f":"COUNTIFS(Data!E$3:E$3663,B25)","v":10},{"$f":"COUNTIFS(Data!E$3:E$3663,B25,Data!F$3:F$3663,\"DNF\")","v":0},10,{"$f":"INDEX(Data!$G$3:$G$3663,MATCH(1,IF(Data!$E$3:$E$3663=$B25,IF(Data!$I$3:$I$3663=\"Fastest\",1)),0))","v":"03:31:48"},{"$f":"_xlfn.MAXIFS(Data!$A$3:$A$3663,Data!$E$3:$E$3663,$B25)","v":2024},null,"10th TRF Marathon in 2024"]
[]
["Athletes at 8 or 9 Runs after the 2024 Townsville Running Festival"]
["Name","Name (Surname / First Name) ","Number","Number Registered","Number Not Completed","Number Completed","Best Time","Last Run"]
["9 Runs Completed"]
[{"$f":"MID(B30,SEARCH(\" \",B30)+1,99)&\" \"&LEFT(B30,SEARCH(\" \",B30)-1)","v":"MATT BAKER"},"BAKER MATT",null,{"$f":"COUNTIFS(Data!E$3:E$3663,B30)","v":9},{"$f":"COUNTIFS(Data!E$3:E$3663,B30,Data!F$3:F$3663,\"DNF\")","v":0},{"$f":"D30-E30","v":9},{"$f":"INDEX(Data!$G$3:$G$3663,MATCH(1,IF(Data!$E$3:$E$3663=$B30,IF(Data!$I$3:$I$3663=\"Fastest\",1)),0))","v":"3.21.44"},{"$f":"_xlfn.MAXIFS(Data!$A$3:$A$3663,Data!$E$3:$E$3663,$B30)","v":2019}]
["RICHARD BANKS","BANKS RICHARD",null,{"$f":"COUNTIFS(Data!E$3:E$3663,B31)","v":9},{"$f":"COUNTIFS(Data!E$3:E$3663,B31,Data!F$3:F$3663,\"DNF\")","v":0},9,{"$f":"INDEX(Data!$G$3:$G$3663,MATCH(1,IF(Data!$E$3:$E$3663=$B31,IF(Data!$I$3:$I$3663=\"Fastest\",1)),0))","v":"2.42.52"},{"$f":"_xlfn.MAXIFS(Data!$A$3:$A$3663,Data!$E$3:$E$3663,$B31)","v":2019}]
[{"$f":"MID(B32,SEARCH(\" \",B32)+1,99)&\" \"&LEFT(B32,SEARCH(\" \",B32)-1)","v":"MICHAEL FITZSIMMONS"},"FITZSIMMONS MICHAEL",null,{"$f":"COUNTIFS(Data!E$3:E$3663,B32)","v":9},{"$f":"COUNTIFS(Data!E$3:E$3663,B32,Data!F$3:F$3663,\"DNF\")","v":0},{"$f":"D32-E32","v":9},{"$f":"INDEX(Data!$G$3:$G$3663,MATCH(1,IF(Data!$E$3:$E$3663=$B32,IF(Data!$I$3:$I$3663=\"Fastest\",1)),0))","v":"3.16.27"},{"$f":"_xlfn.MAXIFS(Data!$A$3:$A$3663,Data!$E$3:$E$3663,$B32)","v":2022}]
[{"$f":"MID(B33,SEARCH(\" \",B33)+1,99)&\" \"&LEFT(B33,SEARCH(\" \",B33)-1)","v":"BRAD HASTEWELL"},"HASTEWELL BRAD",null,{"$f":"COUNTIFS(Data!E$3:E$3663,B33)","v":9},{"$f":"COUNTIFS(Data!E$3:E$3663,B33,Data!F$3:F$3663,\"DNF\")","v":0},{"$f":"D33-E33","v":9},{"$f":"INDEX(Data!$G$3:$G$3663,MATCH(1,IF(Data!$E$3:$E$3663=$B33,IF(Data!$I$3:$I$3663=\"Fastest\",1)),0))","v":"4.32.17"},{"$f":"_xlfn.MAXIFS(Data!$A$3:$A$3663,Data!$E$3:$E$3663,$B33)","v":2024}]
[{"$f":"MID(B34,SEARCH(\" \",B34)+1,99)&\" \"&LEFT(B34,SEARCH(\" \",B34)-1)","v":"SHANE HYNES"},"HYNES SHANE",null,{"$f":"COUNTIFS(Data!E$3:E$3663,B34)","v":9},{"$f":"COUNTIFS(Data!E$3:E$3663,B34,Data!F$3:F$3663,\"DNF\")","v":0},{"$f":"D34-E34","v":9},{"$f":"INDEX(Data!$G$3:$G$3663,MATCH(1,IF(Data!$E$3:$E$3663=$B34,IF(Data!$I$3:$I$3663=\"Fastest\",1)),0))","v":"3.02.13"},{"$f":"_xlfn.MAXIFS(Data!$A$3:$A$3663,Data!$E$3:$E$3663,$B34)","v":2014}]
["PETER LAHIFF","LAHIFF PETER",null,{"$f":"COUNTIFS(Data!E$3:E$3663,B35)","v":10},{"$f":"COUNTIFS(Data!E$3:E$3663,B35,Data!F$3:F$3663,\"DNF\")","v":1},9,{"$f":"INDEX(Data!$G$3:$G$3663,MATCH(1,IF(Data!$E$3:$E$3663=$B35,IF(Data!$I$3:$I$3663=\"Fastest\",1)),0))","v":"2.52.33"},{"$f":"_xlfn.MAXIFS(Data!$A$3:$A$3663,Data!$E$3:$E$3663,$B35)","v":2006},null,"Deceased"]
["ROGER LEBISH","LEBISH ROGER",null,{"$f":"COUNTIFS(Data!E$3:E$3663,B36)","v":9},{"$f":"COUNTIFS(Data!E$3:E$3663,B36,Data!F$3:F$3663,\"DNF\")","v":0},9,{"$f":"INDEX(Data!$G$3:$G$3663,MATCH(1,IF(Data!$E$3:$E$3663=$B36,IF(Data!$I$3:$I$3663=\"Fastest\",1)),0))","v":"3.18.06"},{"$f":"_xlfn.MAXIFS(Data!$A$3:$A$3663,Data!$E$3:$E$3663,$B36)","v":2006},null,"Deceased"]
[{"$f":"MID(B37,SEARCH(\" \",B37)+1,99)&\" \"&LEFT(B37,SEARCH(\" \",B37)-1)","v":"PETER NEIMANIS"},"NEIMANIS PETER",null,{"$f":"COUNTIFS(Data!E$3:E$3663,B37)","v":9},{"$f":"COUNTIFS(Data!E$3:E$3663,B37,Data!F$3:F$3663,\"DNF\")","v":0},{"$f":"D37-E37","v":9},{"$f":"INDEX(Data!$G$3:$G$3663,MATCH(1,IF(Data!$E$3:$E$3663=$B37,IF(Data!$I$3:$I$3663=\"Fastest\",1)),0))","v":"2.34.48"},{"$f":"_xlfn.MAXIFS(Data!$A$3:$A$3663,Data!$E$3:$E$3663,$B37)","v":2024}]
[]
["8 Runs Completed"]
[{"$f":"MID(B40,SEARCH(\" \",B40)+1,99)&\" \"&LEFT(B40,SEARCH(\" \",B40)-1)","v":"JENNY BROWN"},"BROWN JENNY",null,{"$f":"COUNTIFS(Data!E$3:E$3663,B40)","v":8},{"$f":"COUNTIFS(Data!E$3:E$3663,B40,Data!F$3:F$3663,\"DNF\")","v":0},{"$f":"D40-E40","v":8},{"$f":"INDEX(Data!$G$3:$G$3663,MATCH(1,IF(Data!$E$3:$E$3663=$B40,IF(Data!$I$3:$I$3663=\"Fastest\",1)),0))","v":"3.25.58"},{"$f":"_xlfn.MAXIFS(Data!$A$3:$A$3663,Data!$E$3:$E$3663,$B40)","v":2001}]
["JONG JAAP DE","DE JONG JAAP",null,{"$f":"COUNTIFS(Data!E$3:E$3663,B41)","v":8},{"$f":"COUNTIFS(Data!E$3:E$3663,B41,Data!F$3:F$3663,\"DNF\")","v":0},8,{"$f":"INDEX(Data!$G$3:$G$3663,MATCH(1,IF(Data!$E$3:$E$3663=$B41,IF(Data!$I$3:$I$3663=\"Fastest\",1)),0))","v":"3.07.49"},{"$f":"_xlfn.MAXIFS(Data!$A$3:$A$3663,Data!$E$3:$E$3663,$B41)","v":2002}]
["MIKE DONOGHUE","DONOGHUE MIKE",null,{"$f":"COUNTIFS(Data!E$3:E$3663,B42)","v":8},{"$f":"COUNTIFS(Data!E$3:E$3663,B42,Data!F$3:F$3663,\"DNF\")","v":0},8,{"$f":"INDEX(Data!$G$3:$G$3663,MATCH(1,IF(Data!$E$3:$E$3663=$B42,IF(Data!$I$3:$I$3663=\"Fastest\",1)),0))","v":"3.01.57"},{"$f":"_xlfn.MAXIFS(Data!$A$3:$A$3663,Data!$E$3:$E$3663,$B42)","v":2013}]
["SCOTT MCINNES","MCINNES SCOTT",null,{"$f":"COUNTIFS(Data!E$3:E$3663,B43)","v":8},{"$f":"COUNTIFS(Data!E$3:E$3663,B43,Data!F$3:F$3663,\"DNF\")","v":0},8,{"$f":"INDEX(Data!$G$3:$G$3663,MATCH(1,IF(Data!$E$3:$E$3663=$B43,IF(Data!$I$3:$I$3663=\"Fastest\",1)),0))","v":"3.49.57"},{"$f":"_xlfn.MAXIFS(Data!$A$3:$A$3663,Data!$E$3:$E$3663,$B43)","v":2024}]
["BRUCE MERRY","MERRY BRUCE",null,{"$f":"COUNTIFS(Data!E$3:E$3663,B44)","v":8},{"$f":"COUNTIFS(Data!E$3:E$3663,B44,Data!F$3:F$3663,\"DNF\")","v":0},8,{"$f":"INDEX(Data!$G$3:$G$3663,MATCH(1,IF(Data!$E$3:$E$3663=$B44,IF(Data!$I$3:$I$3663=\"Fastest\",1)),0))","v":"2.57.27"},{"$f":"_xlfn.MAXIFS(Data!$A$3:$A$3663,Data!$E$3:$E$3663,$B44)","v":1996}]
["KEITH RICH","RICH KEITH",null,{"$f":"COUNTIFS(Data!E$3:E$3663,B45)","v":8},{"$f":"COUNTIFS(Data!E$3:E$3663,B45,Data!F$3:F$3663,\"DNF\")","v":0},8,{"$f":"INDEX(Data!$G$3:$G$3663,MATCH(1,IF(Data!$E$3:$E$3663=$B45,IF(Data!$I$3:$I$3663=\"Fastest\",1)),0))","v":"3.12.58"},{"$f":"_xlfn.MAXIFS(Data!$A$3:$A$3663,Data!$E$3:$E$3663,$B45)","v":2003}]
["BARRY TOMLIN","TOMLIN BARRY",null,{"$f":"COUNTIFS(Data!E$3:E$3663,B46)","v":8},{"$f":"COUNTIFS(Data!E$3:E$3663,B46,Data!F$3:F$3663,\"DNF\")","v":0},8,{"$f":"INDEX(Data!$G$3:$G$3663,MATCH(1,IF(Data!$E$3:$E$3663=$B46,IF(Data!$I$3:$I$3663=\"Fastest\",1)),0))","v":"2.44.59"},{"$f":"_xlfn.MAXIFS(Data!$A$3:$A$3663,Data!$E$3:$E$3663,$B46)","v":2000}]

{"sheet":"Data","index":2,"n_rows":3663,"n_cols":10,"rows_kept":3663,"cut":false,"hidden":false,"merged":[]}
["TRF Running Festival - Marathon Records"]
["From 1973 to 2024"]
["Year","Run Date","Location (TRF or Virtual)","Run or Wheelchair","Surname & First Name","Place","Time H.MM.SS","Time Min.Sec","Individuals Fastest Time Flag","Marathons completed"]
[1973,"1973-09-23","TRF",null,"CIRCOSTA PAUL",1,"3.06.07",186.07,"Fastest",1]
[1973,"1973-09-23","TRF",null,"CRAIG MAURIE",2,"3.21.10",201.1,"Fastest",1]
[1973,"1973-09-23","TRF",null,"DOWN BOB",3,"3.50.58",230.58,"",2]
[1973,"1973-09-23","TRF",null,"SCULLY DAVE",4,"4.04.47",244.47,"",3]
[1973,"1973-09-23","TRF",null,"STANBROOK ALLAN",5,"4.20.34",260.33999999999997,"",5]
[1973,"1973-09-23","TRF",null,"PHILLIPS MIKE","DNF","DNF","DNF","",1]
[1973,"1973-09-23","TRF",null,"LAHIFF PETER","DNF","DNF","DNF","",9]
[1973,"1973-09-23","TRF",null,"SHELLEY TREV","DNF","DNF","DNF","",0]
[1973,"1973-09-23","TRF",null,"VERCO BOB","DNF","DNF","DNF","",0]
[1973,"1973-09-23","TRF",null,"HENDERSON MIKE","DNF","DNF","DNF","",1]
[1974,"1974-07-20","TRF",null,"PHILLIPS MIKE",1,"2.54.40",174.4,"Fastest",1]
[1974,"1974-07-20","TRF",null,"DOWN BOB",2,"3.03.03",183.03,"Fastest",2]
[1974,"1974-07-20","TRF",null,"BARRALET GRAHAM",3,"3.08.50",188.5,"Fastest",1]
[1974,"1974-07-20","TRF",null,"CROFT JOHN","DNF","DNF","DNF","",0]
[1974,"1974-07-20","TRF",null,"VAN EVERY DALE","DNF","DNF","DNF","",1]
[1974,"1974-07-20","TRF",null,"VERCO BOB","DNF","DNF","DNF","",0]
[1974,"1974-07-20","TRF",null,"STANBROOK ALLAN","DNF","DNF","DNF","",5]
[1974,"1974-07-20","TRF",null,"GROSSMAN KIM","DNF","DNF","DNF","",0]
[1974,"1974-07-20","TRF",null,"SCOTT JOE","DNF","DNF","DNF","",4]
[1974,"1974-07-20","TRF",null,"SCULLY DAVE","DNF","DNF","DNF","",3]
[1975,"1975-07-21","TRF",null,"SCULLY DAVE",1,"2.49.19",169.19,"Fastest",3]
[1975,"1975-07-21","TRF",null,"APPLEFORD D",2,"2.59.17",179.17,"Fastest",1]
[1975,"1975-07-21","TRF",null,"TATTERAL GRAHAM",3,"3.15.21",195.21,"Fastest",1]
[1975,"1975-07-21","TRF",null,"HENDERSON MIKE",4,"3.43.40",223.4,"Fastest",1]
[1976,"1976-08-01","TRF",null,"WILSON GREG",1,"2.38.36",158.36000000000001,"Fastest",9]
[1976,"1976-08-01","TRF",null,"LAHIFF PETER",2,"2.52.33",172.33,"Fastest",9]
[1976,"1976-08-01","TRF",null,"STANBROOK ALLAN",3,"4.44.00",284,"",5]
[1977,"1977-07-16","TRF",null,"WALKER BOB",1,"2.52.11",172.11,"",3]
[1977,"1977-07-16","TRF",null,"SCULLY DAVE",2,"3.01.03",181.03,"",3]
[1977,"1977-07-16","TRF",null,"ROOKE B",3,"3.04.05",184.05,"Fastest",1]
[1977,"1977-07-16","TRF",null,"COOPER BRAD",4,"3.05.58",185.58,"Fastest",2]
[1977,"1977-07-16","TRF",null,"CLYNE DAN",5,"3.11.00",191,"Fastest",1]
[1977,"1977-07-16","TRF",null,"HEPPLE JOHN",6,"3.14.14",194.14,"",2]
[1978,"1978-07-15","TRF",null,"HEPPLE JOHN",1,"2.52.00",172,"Fastest",2]
[1978,"1978-07-15","TRF",null,"VAN EVERY DALE",2,"2.59.56",179.56,"Fastest",1]
[1978,"1978-07-15","TRF",null,"CARLTON JOHN",3,"3.06.31",186.31,"",6]
[1978,"1978-07-15","TRF",null,"OBRIAN D",4,"3.38.30",218.3,"Fastest",1]
[1978,"1978-07-15","TRF",null,"WOJOCHEWOSKI STAN",5,"3.59.05",239.05,"",4]
[1978,"1978-07-15","TRF",null,"COTTERAL D",6,"3.59.05",239.05,"Fastest",1]
[1978,"1978-07-15","TRF",null,"PRUDEAU JULIE",7,"3.59.52",239.52,"Fastest",2]
[1979,"1979-07-22","TRF",null,"FOSTER DAMIEN",1,"2.43.30",163.30000000000001,"Fastest",2]
[1979,"1979-07-22","TRF",null,"WALKER BOB",2,"2.45.10",165.1,"Fastest",3]
[1979,"1979-07-22","TRF",null,"CARLTON JOHN",3,"2.50.09",170.09,"",6]
[1979,"1979-07-22","TRF",null,"WHITE BILL",4,"2.50.38",170.38,"Fastest",1]
[1979,"1979-07-22","TRF",null,"SMITH PETER",5,"3.04.01",184.01,"Fastest",1]
[1979,"1979-07-22","TRF",null,"ROWDEN WIDGE",6,"3.06.19",186.19,"",4]
[1979,"1979-07-22","TRF",null,"AITKEN RON",7,"3.10.31",190.31,"",3]
[1979,"1979-07-22","TRF",null,"COOPER BRAD",8,"3.18.37",198.37,"",2]
[1979,"1979-07-22","TRF",null,"HANNAFORD GARY",9,"3.18.37",198.37,"",5]
[1979,"1979-07-22","TRF",null,"WORTHINGTON PETER",10,"3.31.20",211.2,"",2]
[1979,"1979-07-22","TRF",null,"WOJOCHEWOSKI STAN",11,"3.35.21",215.21,"",4]
[1979,"1979-07-22","TRF",null,"WILSON GREG",12,"3.35.21",215.21,"",9]
[1979,"1979-07-22","TRF",null,"PRUDEAU JULIE",13,"4.02.02",242.02,"",2]
[1980,"1980-07-12","TRF",null,"CARLTON JOHN",1,"2.44.45",164.45,"",6]
[1980,"1980-07-12","TRF",null,"WALKER BOB",2,"2.51.00",171,"",3]
[1980,"1980-07-12","TRF",null,"FOSTER DAMIEN",3,"2.52.32",172.32,"",2]
[1980,"1980-07-12","TRF",null,"ROWDEN WIDGE",4,"2.54.26",174.26,"",4]
[1980,"1980-07-12","TRF",null,"HANNAFORD GARY",5,"3.00.06",180.06,"",5]
[1980,"1980-07-12","TRF",null,"AITKEN RON",6,"3.07.32",187.32,"",3]
[1980,"1980-07-12","TRF",null,"SCOTT JOE",7,"3.14.16",194.16,"",4]
[1980,"1980-07-12","TRF",null,"HEPPEL JOHN",8,"3.15.55",195.55,"Fastest",1]
[1980,"1980-07-12","TRF",null,"ANDERSON G",9,"3.18.06",198.06,"Fastest",1]
[1980,"1980-07-12","TRF",null,"KNEWSTUB MICK",10,"3.18.07",198.07,"",3]
[1980,"1980-07-12","TRF",null,"WILES R",11,"3.24.23",204.23,"Fastest",3]
[1980,"1980-07-12","TRF",null,"FITTLER PAT",12,"3.24.26",204.26,"",2]
[1980,"1980-07-12","TRF",null,"BAKER H",13,"3.33.00",213,"Fastest",1]
[1980,"1980-07-12","TRF",null,"ELMS N",14,"3.41.21",221.21,"Fastest",1]
[1980,"1980-07-12","TRF",null,"MORTON D",15,"3.46.00",226,"Fastest",1]
[1980,"1980-07-12","TRF",null,"HALL PETER",16,"3.48.08",228.08,"",2]
[1980,"1980-07-12","TRF",null,"LEITCH TED",17,"3.50.01",230.01,"",5]
[1980,"1980-07-12","TRF",null,"MEADOWS R",18,"3.55.10",235.1,"Fastest",1]
[1980,"1980-07-12","TRF",null,"PASK S",19,"4.15.00",255,"Fastest",1]
[1980,"1980-07-12","TRF",null,"BUCHANON J",20,"4.15.45",255.45,"Fastest",1]
[1980,"1980-07-12","TRF",null,"ROBINSON H",21,"4.15.45",255.45,"Fastest",1]
[1981,"1981-07-19","TRF",null,"MILLS MARTIN",1,"2.40.10",160.1,"Fastest",1]
[1981,"1981-07-19","TRF",null,"HANNAFORD GARY",2,"2.42.21",162.21,"",5]
[1981,"1981-07-19","TRF",null,"SCHAFFERIUS BEVAN",3,"2.49.25",169.25,"",2]
{"$rows_left_out":3584}
{"sheet":"Notes","index":3,"n_rows":3,"n_cols":1,"rows_kept":3,"cut":false,"hidden":true,"merged":[]}
["1973 and 1974 has several people without times - 1 year there was an issue with the course length being significantly short but some people were given a time so I can only assume they completed the distance."]
["In 2000, there was a timing issue and no times were available."]
["Be careful with Matt Baker - There is a Matt Baker who has done 9 runs and another younger Matt Baker who done 1 run in 2012.  Both did the 2012 TRF.  The Age group and Year is used to separate them.  "]